﻿ID,article,method,device,Chip/Biosensor,Software,Evaluation Method,Fitting Model,Fixed Partner,Fixed Partner,Fixed Partner,Fixed Partner Type:,Fixed Partner Main Type:,Fixed Protein/DNA Sequence or SMILE,Fixed Partner Species,Soluble Partner,Soluble Partner,Soluble Partner,Soluble Partner Type:,Soluble Partner Main Type:,Soluble Protein/DNA Sequence or SMILE,Soluble Partner Species,kon/kass/ka,STD kon,koff/kdis/kd,STD koff,KD,STD KD,comment,Figures and tables,Is raw data present?,Is the raw data of good quality?,Are fits shown?,How do the fits look?,article__doi,article__journal,article__pubdate,article__title
309,PMC3982047,Microscale Thermophoresis (MST),Monolith NT.115,,,,,AtNRT1.1,Arabidopsis thaliana nitrate transporter,,Protein,P,,A. thaliana,Chlorate,,,,U,,,,,,,0.0048,0.0003,,subfig2,Y,N,Y,B,10.1038/nature13116,Nature,2014-02-26,Molecular basis of nitrate uptake by the plant nitrate transporter NRT1.1
1759,PMC4309432,Microscale Thermophoresis (MST),Monolith NT.115,Monolith NT Standard Treated Capillaries,,,,rACBP3,recombinant acyl-CoA-binding protein 3,,,P,,A. thaliana,18:2-CoA,18:2 acetyl-CoA,,,C,,,,,,,7.88e-07,1.37e-08,,fig 9,Y,X,Y,R,10.1111/tpj.12692,The Plant Journal,2014-10-06,Arabidopsis acyl-CoA-binding protein ACBP3 participates in plant response to hypoxia by modulating very-long-chain fatty acid metabolism
1761,PMC4309432,Microscale Thermophoresis (MST),Monolith NT.115,Monolith NT Standard Treated Capillaries,,,,rACBP3,recombinant acyl-CoA-binding protein 3,,,P,,A. thaliana,22:0-CoA,22:0 acetyl-CoA,,,C,,,,,,,0.0299,0.003,,fig 9,Y,X,Y,R,10.1111/tpj.12692,The Plant Journal,2014-10-06,Arabidopsis acyl-CoA-binding protein ACBP3 participates in plant response to hypoxia by modulating very-long-chain fatty acid metabolism
1760,PMC4309432,Microscale Thermophoresis (MST),Monolith NT.115,Monolith NT Standard Treated Capillaries,,,,rACBP3,recombinant acyl-CoA-binding protein 3,,,P,,A. thaliana,20:0-CoA,20:0 acetyl-CoA,,,C,,,,,,,6.6e-08,1.5e-08,,fig 9,Y,N,Y,R,10.1111/tpj.12692,The Plant Journal,2014-10-06,Arabidopsis acyl-CoA-binding protein ACBP3 participates in plant response to hypoxia by modulating very-long-chain fatty acid metabolism
307,PMC3982047,Microscale Thermophoresis (MST),Monolith NT.115,,,,,AtNRT1.1,Arabidopsis thaliana nitrate transporter,,Protein,P,,A. thaliana,nitrate,,,,U,,,,,,,0.001,0.00015,,"fig1a,subfig2",Y,Y,Y,R,10.1038/nature13116,Nature,2014-02-26,Molecular basis of nitrate uptake by the plant nitrate transporter NRT1.1
1349,PMC4066763,Microscale Thermophoresis (MST),Monolith NT.115,hydrophilic capillaries,"NanoTemper analysis software v1.5.17, Origin 9.1",,,Bat1,Burkholderia TALE-like proteins,labelled with the protein labelling kit RED (Nanotemper),,P,,B. rhizoxinica,BE Bat1 C-0,,,,D,TAGACCAAGAGAAGCAAAGACGTTATATGC,,,,,,8.7e-08,3.8e-08,Bat1 sequence: Uniprot E5AV36,supfig7,Y,Y,Y,G,10.1093/nar/gku329,Nucleic Acids Research,2014-05-03,Programmable DNA-binding proteins from Burkholderia provide a fresh perspective on the TALE-like repeat domain
1564,PMC3513319,Surface Plasmon Resonance (SPR),Biacore 3000 system and NTA sensorchips,NTA sensor chips,BIAevaluation software,single-cycle kinetic method,1:1 partial local fitting model,CheC,None,,receptor,P,,B. subtilis,CheD-CheYp,None,,,X,,,178967.0,13284.0,0.0976,0.0057,5.46e-07,3.31e-08,,,Y,Y,Y,G,10.1371/journal.pone.0050689,PLoS ONE,2012-12-03,The Importance of the Interaction of CheD with CheC and the Chemoreceptors Compared to Its Enzymatic Activity during Chemotaxis in Bacillus subtilis
1492,PMC4423239,Surface Plasmon Resonance (SPR),Biacore 2000,CM5 Sensor Chip,BIAevaluation 3.1.1,,1:1 Langmuir binding,hC5a C704R,human C5a C704R,mutant,,P,,H. sapiens,NOX-D20,NOX-D20,,aptamer,D,,,3210000.0,1000.0,8.87e-05,3.7e-06,2.76e-10,,,Supplementary fig. 6 a,Y,Y,Y,R,10.1038/ncomms7481,Nature Communications,2015-04-22,Structural basis for the targeting of complement anaphylatoxin C5a using a mixed L-RNA/L-DNA aptamer
1021,PMC4303316,Surface Plasmon Resonance (SPR),"Biacore 3000, ProteOn XPR36",NTA biosensor,GraphPad Prism version 5.0,,,EhPAK5 PBD,Eh p21 activiated kinase p21 binding domain,kinase,ezyme,P,,E. Coli,EhRacG GppNHp,EhRacG GppNHp,GTPase,enzyme,P,,,,,,,,,No binding,Fig. 2,Y,X,N,X,10.1021/bi501226f,Biochemistry,2014-12-22,Entamoeba histolytica RacC Selectively Engages p21-Activated Kinase Effectors
1750,PMC5453625,Surface Plasmon Resonance (SPR),BIAcore 3000,CM5 biosensor chip,,,,SW,SW-nectin-1,ecto-domain proteins,protein,P,,E. Coli,PRV gD,PRV glycoprotein D 284,,Glycoprotein,P,,,1150000.0,,0.0211,,1.84e-08,,,fig.2,Y,Y,Y,X,10.1371/journal.ppat.1006314,PLoS Pathogens,2017-05-19,Structural basis of nectin-1 recognition by pseudorabies virus glycoprotein D
1751,PMC5453625,Surface Plasmon Resonance (SPR),BIAcore 3000,CM5 biosensor chip,,,,SW,SW-nectin-1,ecto-domain proteins,protein,P,,E. Coli,PRV gD,PRV glycoprotein D 337,,Glycoprotein,P,,,146000.0,,0.044,,3.01e-07,,,fig.2,Y,Y,N,X,10.1371/journal.ppat.1006314,PLoS Pathogens,2017-05-19,Structural basis of nectin-1 recognition by pseudorabies virus glycoprotein D
1017,PMC4303316,Surface Plasmon Resonance (SPR),"Biacore 3000, ProteOn XPR36",NTA biosensor,GraphPad Prism version 5.0,,,EhPAK4 PBD,Eh p21 activiated kinase p21 binding domain,kinase,ezyme,P,,E. Coli,EhRacD GppNHp,EhRacD GppNHp,GTPase,enzyme,P,,,,,,,,,No binding,Fig. 2,Y,X,Y,X,10.1021/bi501226f,Biochemistry,2014-12-22,Entamoeba histolytica RacC Selectively Engages p21-Activated Kinase Effectors
1739,PMC3281051,Surface Plasmon Resonance (SPR),Biacore 2000,CM5 or 2D carboxymethyldextran surface CMDP,Biacore software,1∶1 Langmuir binding model,1:1 binding model,VEGF 165,Vascular endothelial growth factor (VEGF165),,Growth factor,P,,H. sapiens,SL12,,,Aptamer,OD,ATACCAGTCTATTCAATTGGGCCCGTCCGTATGGTGGG,,,,,,5e-09,4.5e-10,,,N,X,N,X,10.1371/journal.pone.0031196,PLoS ONE,2012-02-16,Probing High Affinity Sequences of DNA Aptamer against VEGF165
1537,PMC3513319,Surface Plasmon Resonance (SPR),Biacore 3000 system and NTA sensorchips,NTA chips,BiaEvaluation software,single-cycle kinetic method,1:1 partial local fitting model,CheC,None,,Receptor,P,,B. subtilis,CheC-CheD-CheY,None,,Protein,P,,B. subtilis,10627.0,1184.0,0.0743,0.0079,7.01e-06,5.3e-07,,,Y,Y,Y,G,10.1371/journal.pone.0050689,PLoS ONE,2012-12-03,The Importance of the Interaction of CheD with CheC and the Chemoreceptors Compared to Its Enzymatic Activity during Chemotaxis in Bacillus subtilis
1736,PMC3547035,Surface Plasmon Resonance (SPR),Biacore 2000,CM5 or 2D carboxymethyldextran surface CMDP,BIA-evaluation software version 4.1,1∶1 Langmuir binding model,1:1 Langmuir binding,VEGF-A165,vascular endothelial growth factor (,,Growth factor,P,,H. sapiens,SL2-B,PS-modified SL2-B aptamer,80 nM aptamer concentration.,aptamer,OD,,,,,,,5.6e-10,4.4e-10,,,Y,Y,X,X,10.1371/journal.pone.0050964,PLoS ONE,2013-01-16,Investigating the Antiproliferative Activity of High Affinity DNA Aptamer on Cancer Cells
232,PMC4140853,Bio-Layer Interferometry (BLI),ForteBio Octet RED96,SA chip,,global curve analysis,1∶1 Langmuir,HLA-DQ2,cell surface receptor protein,,Receptor,P,,H. sapiens,gp42  I159C,glycoprotein 42   I159C,mutant,Protein,P,,Epstein-Barr virus,202000.0,5000.0,0.0119,8.8e-05,5.9e-08,,,"tab2,fig7",Y,Y,Y,G,10.1371/journal.ppat.1004309,PLoS Pathogens,2014-08-21,Assembly and Architecture of the EBV B Cell Entry Triggering Complex
234,PMC4140853,Bio-Layer Interferometry (BLI),ForteBio Octet RED96,SA chip,,,2:1 HL model,HLA-DQ2,cell surface receptor protein,,Receptor,P,,H. sapiens,gHgL/gp42,glycoprotein H glycoprotein L / glycoprotein 42,complex,Protein,P,,Epstein-Barr virus,106000.0,5000.0,0.001448,2.4e-05,1.364e-08,,,tab2,N,X,N,X,10.1371/journal.ppat.1004309,PLoS Pathogens,2014-08-21,Assembly and Architecture of the EBV B Cell Entry Triggering Complex
236,PMC4140853,Bio-Layer Interferometry (BLI),ForteBio Octet RED96,SA chip,Equilibrium Analysis,,1∶1 Langmuir,HLA-DQ2,cell surface receptor protein,,Receptor,P,,H. sapiens,gHgL/gp42,glycoprotein H glycoprotein L / glycoprotein 42,complex,Protein,P,,Epstein-Barr virus,,,,,1.2e-07,2.2e-08,,tab2,N,X,N,X,10.1371/journal.ppat.1004309,PLoS Pathogens,2014-08-21,Assembly and Architecture of the EBV B Cell Entry Triggering Complex
1016,PMC4303316,Surface Plasmon Resonance (SPR),"Biacore 3000, ProteOn XPR36",NTA biosensor,GraphPad Prism version 5.0,,,EhPAK4 PBD,Eh p21 activiated kinase p21 binding domain,kinase,ezyme,P,,E. Coli,EhRacG GppNHp,EhRacG GppNHp,GTPase,enzyme,P,,,,,,,,,No binding,Fig. 2,Y,X,N,X,10.1021/bi501226f,Biochemistry,2014-12-22,Entamoeba histolytica RacC Selectively Engages p21-Activated Kinase Effectors
1748,PMC5453625,Surface Plasmon Resonance (SPR),BIAcore 3000,CM5 biosensor chip,,,,HU,HU-nectin-1,ecto-domain proteins,protein,P,,E. Coli,PRV gD,PRV glycoprotein D 337,,Glycoprotein,P,,,141000.0,,0.027,,1.91e-07,,,fig.2,Y,Y,N,X,10.1371/journal.ppat.1006314,PLoS Pathogens,2017-05-19,Structural basis of nectin-1 recognition by pseudorabies virus glycoprotein D
862,PMC3164629,Surface Plasmon Resonance (SPR),Biacore 3000,CM5 Sensor Chip,,,,WT JRFL gp140 + CD4,WT JRFL gp140 + CD4,,glycoprotein,P,,H. sapiens immunodeficiency virus,17b,17b,,antibody,P,,,44000.0,,0.00042,,9.5e-09,,,Fig. 2B,Y,Y,Y,R,10.1371/journal.ppat.1002200,PLoS Pathogens,2011-09-01,Envelope Deglycosylation Enhances Antigenicity of HIV-1 gp41 Epitopes for Both Broad Neutralizing Antibodies and Their Unmutated Ancestor Antibodies
1737,PMC3547035,Surface Plasmon Resonance (SPR),Biacore 2000,CM5 or 2D carboxymethyldextran surface CMDP,BIA-evaluation software version 4.1,1∶1 Langmuir binding model,1:1 Langmuir binding,VEGF-A121,vascular endothelial growth factor (,,Growth factor,P,,H. sapiens,SL2-B,PS-modified SL2-B aptamer,80 nM aptamer concentration.,aptamer,OD,,,,,,,1.7e-05,1.24e-06,,,Y,Y,X,X,10.1371/journal.pone.0050964,PLoS ONE,2013-01-16,Investigating the Antiproliferative Activity of High Affinity DNA Aptamer on Cancer Cells
1738,PMC3281051,Surface Plasmon Resonance (SPR),Biacore 2000,CM5 or 2D carboxymethyldextran surface CMDP,Biacore software,1∶1 Langmuir binding model,1:1 binding model,VEGF 165,Vascular endothelial growth factor (VEGF165),,Growth factor,P,,H. sapiens,VEa5,,,Aptamer,OD,ATACCAGTCTATTCAATTGGGCCCGTCCGTATGGTGGGTGTGCTGGCCAGATAGTATGTGCAATCA,,,,,,1.2e-07,1.8e-09,,,N,X,N,X,10.1371/journal.pone.0031196,PLoS ONE,2012-02-16,Probing High Affinity Sequences of DNA Aptamer against VEGF165
1024,PMC4303316,Surface Plasmon Resonance (SPR),"Biacore 3000, ProteOn XPR36",NTA biosensor,GraphPad Prism version 5.0,,,EhPAK4(R42D),Eh p21 activiated kinase p21 binding domain,kinase mutant,ezyme,P,,E. Coli,EhRacC(Q65L) GTP,EhRacC(Q65L) GTP,GTPase,enzyme,P,,,,,,,2.3e-07,4e-08,,Fig. 5C,Y,X,N,X,10.1021/bi501226f,Biochemistry,2014-12-22,Entamoeba histolytica RacC Selectively Engages p21-Activated Kinase Effectors
1742,PMC3281051,Surface Plasmon Resonance (SPR),Biacore 2000,CM5 or 2D carboxymethyldextran surface CMDP,Biacore software,1∶1 Langmuir binding model,1:1 binding model,VEGF 165,Vascular endothelial growth factor (VEGF165),,Growth factor,P,,H. sapiens,SL2-A,,,Aptamer,OD,GCCCGTCCGTATGGTGGGT,,,,,,1e-08,1.1e-09,,,N,X,N,X,10.1371/journal.pone.0031196,PLoS ONE,2012-02-16,Probing High Affinity Sequences of DNA Aptamer against VEGF165
1022,PMC4303316,Surface Plasmon Resonance (SPR),"Biacore 3000, ProteOn XPR36",NTA biosensor,GraphPad Prism version 5.0,,,EhPAK5 PBD,Eh p21 activiated kinase p21 binding domain,kinase,ezyme,P,,E. Coli,EhRacD GppNHp,EhRacD GppNHp,GTPase,enzyme,P,,,,,,,,,No binding,Fig. 2,Y,X,N,X,10.1021/bi501226f,Biochemistry,2014-12-22,Entamoeba histolytica RacC Selectively Engages p21-Activated Kinase Effectors
1743,PMC3281051,Surface Plasmon Resonance (SPR),Biacore 2000,CM5 or 2D carboxymethyldextran surface CMDP,Biacore software,1∶1 Langmuir binding model,1:1 binding model,VEGF 165,Vascular endothelial growth factor (VEGF165),,Growth factor,P,,H. sapiens,SL2-B,,,Aptamer,OD,CAATTGGGCCCGTCCGTATGGTGGGT,,,,,,5e-10,3.2e-10,,,Y,Y,N,X,10.1371/journal.pone.0031196,PLoS ONE,2012-02-16,Probing High Affinity Sequences of DNA Aptamer against VEGF165
1019,PMC4303316,Surface Plasmon Resonance (SPR),"Biacore 3000, ProteOn XPR36",NTA biosensor,GraphPad Prism version 5.0,,,EhPAK5 PBD,Eh p21 activiated kinase p21 binding domain,kinase,ezyme,P,,E. Coli,EhRacC GDP,EhRacC GDP,GTPase,enzyme,P,,,,,,,,,No binding,Fig. 2,Y,X,N,X,10.1021/bi501226f,Biochemistry,2014-12-22,Entamoeba histolytica RacC Selectively Engages p21-Activated Kinase Effectors
1020,PMC4303316,Surface Plasmon Resonance (SPR),"Biacore 3000, ProteOn XPR36",NTA biosensor,GraphPad Prism version 5.0,,,EhPAK5 PBD,Eh p21 activiated kinase p21 binding domain,kinase,ezyme,P,,E. Coli,EhRho1 GppNHp,EhRho1 GppNHp,GTPase,enzyme,P,,,,,,,,,No binding,Fig. 2,Y,X,N,X,10.1021/bi501226f,Biochemistry,2014-12-22,Entamoeba histolytica RacC Selectively Engages p21-Activated Kinase Effectors
1018,PMC4303316,Surface Plasmon Resonance (SPR),"Biacore 3000, ProteOn XPR36",NTA biosensor,GraphPad Prism version 5.0,,,EhPAK5 PBD,Eh p21 activiated kinase p21 binding domain,kinase,ezyme,P,,E. Coli,EhRacC(Q65L) GTP,EhRacC(Q65L) GTP,GTPase mutant,enzyme,P,,,,,,,1.9e-06,2e-07,,Fig. 2,Y,Y,N,X,10.1021/bi501226f,Biochemistry,2014-12-22,Entamoeba histolytica RacC Selectively Engages p21-Activated Kinase Effectors
1023,PMC4303316,Surface Plasmon Resonance (SPR),"Biacore 3000, ProteOn XPR36",NTA biosensor,GraphPad Prism version 5.0,,,EhPAK4wt,Eh p21 activiated kinase p21 binding domain,kinase wild type,ezyme,P,,E. Coli,EhRacC(Q65L) GTP,EhRacC(Q65L) GTP,GTPase,enzyme,P,,,,,,,1.8e-07,5e-08,,Fig. 5C,Y,X,N,X,10.1021/bi501226f,Biochemistry,2014-12-22,Entamoeba histolytica RacC Selectively Engages p21-Activated Kinase Effectors
1524,PMC420254,Surface Plasmon Resonance (SPR),Biacore 3000,CM5,,,,AVP-1C6,Anti Anthrax PA Antibody AVP-1C6,,Antibody,P,,H. sapiens,Anthrax Toxin Subunit PA,,,Toxin,P,,B. anthracis,185000.0,,0.000131,,7.11e-10,,anti human Ab was immobilized on a CM5 chip and loaded with the anti Anthrax Toxin Subunit PA antibody,tab 2,N,X,N,X,10.1186/1476-8518-2-5,Journal of Immune Based Therapies and Vaccines,2004-05-12,Human anti-anthrax protective antigen neutralizing monoclonal antibodies derived from donors vaccinated with anthrax vaccine adsorbed
1526,PMC420254,Surface Plasmon Resonance (SPR),Biacore 3000,CM5,,,,AVP-22G12,Anti Anthrax PA Antibody AVP-22G12,,Antibody,P,,H. sapiens,Anthrax Toxin Subunit PA,,,Toxin,P,,B. anthracis,101000.0,,5.17e-05,,5.12e-10,,anti human Ab was immobilized on a CM5 chip and loaded with the anti Anthrax Toxin Subunit PA antibody,tab 2,N,X,N,X,10.1186/1476-8518-2-5,Journal of Immune Based Therapies and Vaccines,2004-05-12,Human anti-anthrax protective antigen neutralizing monoclonal antibodies derived from donors vaccinated with anthrax vaccine adsorbed
399,PMC2196039,Surface Plasmon Resonance (SPR),Biacore,CM5,,,,TCR binding peptide,TCR binding peptide,,Peptide,OP,,,MHC,MHC,,Protein,P,,,,,,,,,,tab. 4,N,X,N,X,,The Journal of Experimental Medicine,1997-02-03,CD80 (B7-1) Binds Both CD28 and CTLA-4 with a Low Affinity and Very Fast Kinetics
922,PMC3164629,Surface Plasmon Resonance (SPR),Biacore 3000,CM5 Sensor Chip,,,,Deg JRFL gp140,Deglycosylated JRFL gp140,,glycoprotein,P,,H. sapiens immunodeficiency virus,4E10_RUA,4E10_RUA,,,U,,,4610.0,,0.00147,,3.18e-07,,No binding,Fig. 9F,Y,N,Y,B,10.1371/journal.ppat.1002200,PLoS Pathogens,2011-09-01,Envelope Deglycosylation Enhances Antigenicity of HIV-1 gp41 Epitopes for Both Broad Neutralizing Antibodies and Their Unmutated Ancestor Antibodies
864,PMC3164629,Surface Plasmon Resonance (SPR),Biacore 3000,CM5 Sensor Chip,,,,WT JRFL gp140 + A32,WT JRFL gp140 + A32,,glycoprotein,P,,H. sapiens immunodeficiency virus,17b,17b,,antibody,P,,,35000.0,,0.00021,,6e-09,,,Fig. 2B,Y,Y,Y,R,10.1371/journal.ppat.1002200,PLoS Pathogens,2011-09-01,Envelope Deglycosylation Enhances Antigenicity of HIV-1 gp41 Epitopes for Both Broad Neutralizing Antibodies and Their Unmutated Ancestor Antibodies
921,PMC3164629,Surface Plasmon Resonance (SPR),Biacore 3000,CM5 Sensor Chip,,,,WT JRFL gp140,Wild type JRFL gp140,,glycoprotein,P,,H. sapiens immunodeficiency virus,4E10_RUA,4E10_RUA,,,U,,,,,,,,,No binding,Fig. 9E,Y,X,N,X,10.1371/journal.ppat.1002200,PLoS Pathogens,2011-09-01,Envelope Deglycosylation Enhances Antigenicity of HIV-1 gp41 Epitopes for Both Broad Neutralizing Antibodies and Their Unmutated Ancestor Antibodies
1000,PMC3589475,Surface Plasmon Resonance (SPR),Biacore T100,CM5 Sensor Chip,Scrubber 2.0 software,,1∶1 kinetic model,WT CA,wild type capsid protein,,protein,P,ITFEDLLDYYGP,H. sapiens immunodeficiency virus,BM2,BM2,,peptide,OP,,,,,,,1.4e-07,,,Fig. 6E,Y,N,Y,B,10.1371/journal.pone.0058035,PLoS ONE,2013-03-05,Large-Scale Functional Purification of Recombinant HIV-1 Capsid
863,PMC3164629,Surface Plasmon Resonance (SPR),Biacore 3000,CM5 Sensor Chip,,,,Deg JRFL gp140 + CD4,Deg JRFL gp140 + CD4,,glycoprotein,P,,H. sapiens immunodeficiency virus,17b,17b,,antibody,P,,,21600.0,,0.00054,,2.5e-08,,,Fig. 2B,Y,Y,Y,B,10.1371/journal.ppat.1002200,PLoS Pathogens,2011-09-01,Envelope Deglycosylation Enhances Antigenicity of HIV-1 gp41 Epitopes for Both Broad Neutralizing Antibodies and Their Unmutated Ancestor Antibodies
867,PMC3164629,Surface Plasmon Resonance (SPR),Biacore 3000,,,,,Deg JRFL gp140 + T8,Deg JRFL gp140 + T8,,glycoprotein,P,,H. sapiens immunodeficiency virus,17b,17b,,antibody,P,,,,,,,,,no binding,Fig. 2B,Y,N,Y,B,10.1371/journal.ppat.1002200,PLoS Pathogens,2011-09-01,Envelope Deglycosylation Enhances Antigenicity of HIV-1 gp41 Epitopes for Both Broad Neutralizing Antibodies and Their Unmutated Ancestor Antibodies
210,PMC5104462,Bio-Layer Interferometry (BLI),ForteBio Octet RED96,Anti-hIgG Fc Capture (AHC) Biosensor,,,1:1,Fc-DC-SIGN,dendritic cell-specific intercellular adhesion molecule-3-grabbing non-integrin,Fc region,Receptor,P,,H. sapiens,dengue virus,dengue virus,in Tyrone solution,Virus,U,,,5200000.0,130000.0,0.0013,4e-05,2.46e-10,,0.5nm Fc-DC-SIGN immobilized,"tab1,supfig1",Y,Y,N,X,10.1371/journal.pone.0166474,PLoS ONE,2016-11-10,Dengue Virus Infection Is through a Cooperative Interaction between a Mannose Receptor and CLEC5A on Macrophage as a Multivalent Hetero-Complex
211,PMC5104462,Bio-Layer Interferometry (BLI),ForteBio Octet RED96,Anti-hIgG Fc Capture (AHC) Biosensor,,,1:1,Fc-DC-SIGN + Fc-CLEC5A,dendritic cell-specific intercellular adhesion molecule-3-grabbing non-integrin + C-type lectin domain family 5 member A,Fc region,Receptor,P,,H. sapiens,dengue virus,dengue virus,in Tyrone solution,Virus,U,,,2900000.0,30000.0,0.0012,9e-05,4.27e-10,,0.5nm Fc-DC-SIGN + 0.5nm Fc-CLEC5A immobilized,"tab1,supfig1",Y,Y,N,X,10.1371/journal.pone.0166474,PLoS ONE,2016-11-10,Dengue Virus Infection Is through a Cooperative Interaction between a Mannose Receptor and CLEC5A on Macrophage as a Multivalent Hetero-Complex
1523,PMC420254,Surface Plasmon Resonance (SPR),Biacore 3000,CM5,,,,AVP-21D9,Anti Anthrax PA Antibody AVP-21D9,,Antibody,P,,H. sapiens,Anthrax Toxin Subunit PA,,,Toxin,P,,B. anthracis,180000.0,,1.48e-05,,8.21e-11,,anti human Ab was immobilized on a CM5 chip and loaded with the anti Anthrax Toxin Subunit PA antibody,tab 2,N,X,N,X,10.1186/1476-8518-2-5,Journal of Immune Based Therapies and Vaccines,2004-05-12,Human anti-anthrax protective antigen neutralizing monoclonal antibodies derived from donors vaccinated with anthrax vaccine adsorbed
354,PMC5430821,Surface Plasmon Resonance (SPR),"Biacore 3000, Biacore T200",CM5 or 2D carboxymethyldextran surface CMDP,Biacore T200 Evaluation software 2.0 or BIAevaluation software 4.1,single-cycle kinetic method,1:1 titration kinetic binding model,mAb antibodies,exoSYT2/GT1b,BoNT/B receptor synaptotagmin 2/Ganglioside GT1b exosomes,Protein,P,,H. sapiens,BoNT/B holotoxin (B1),Botulinum Neurotoxin/B holotoxin (B1),,Protein,P,,C. botulinum,230000.0,1.0,0.00013,0.5,6e-10,0.1,,,Y,Y,Y,R,10.1038/s41598-017-01198-1,Scientific Reports,2017-04-21,Affinity biosensors using recombinant native membrane proteins displayed on exosomes: application to botulinum neurotoxin B receptor
1728,PMC3620356,Bio-Layer Interferometry (BLI),ForteBio Octet QK,ForteBio AHC,ForteBio software,Single Curve Analysis,1:1 binding model,NIH 45-46 Germline,,,Antibody,P,,H. sapiens,Nb_An05 (WT),N276D.N460D.N463D,,viral protein,P,,H. sapiens immunodeficiency virus,9870.0,495.0,0.000244,1.24e-06,4.6e-08,,,tabS3,Y,Y,Y,R,10.1084/jem.20122824,The Journal of Experimental Medicine,2013-04-08,Engineering HIV envelope protein to activate germline B cell receptors of broadly neutralizing anti-CD4 binding site antibodies
1723,PMC3620356,Bio-Layer Interferometry (BLI),ForteBio Octet QK,ForteBio AHC,ForteBio software,Single Curve Analysis,1:1 binding model,NIH45-46 Mature,,,Antibody,P,,H. sapiens,WT,Wildtype,,viral protein,P,,H. sapiens immunodeficiency virus,5350.0,200.0,5.82e-05,1.1e-05,1.06e-08,,,tabS3,Y,Y,Y,R,10.1084/jem.20122824,The Journal of Experimental Medicine,2013-04-08,Engineering HIV envelope protein to activate germline B cell receptors of broadly neutralizing anti-CD4 binding site antibodies
621,PMC2749821,Surface Plasmon Resonance (SPR),Biacore 2000,CM5,BIAevaluation software 2.2.4,,1:1 Langmuir binding model,BMPR-IA,Bone Morphogenetic Protein Receptor IA,AA: 24-152,Receptor,P,,H. sapiens,BMP2,Bone Morphogenetic Protein 2,AA:283-396 + N-terminal Met-Ala,Protein,P,,H. sapiens,500000.0,121000.0,0.0004,9e-05,8e-10,3.7e-10,,"tab1,supfig3",Y,Y,X,X,10.1186/1741-7007-7-59,BMC Biology,2009-09-07,Receptor oligomerization and beyond: a case study in bone morphogenetic proteins
151,PMC5098251,Bio-Layer Interferometry (BLI),ForteBio Octet RED384,SA Biosensor,ForteBio Data Analysis Software,1∶1 Langmuir binding model,,FasR,Fas Receptor,Biotinylated,Receptor,P,,H. sapiens,scFv A03a,anti-Fas receptor single chain variable fragment,,single chain variable fragment,P,,H. sapiens,240000.0,97000.0,0.000181,5.3e-05,1.09e-09,9e-11,,tab1,N,X,N,X,10.1038/srep36391,Scientific Reports,2016-11-07,A Shorter Route to Antibody Binders via Quantitative in vitro Bead-Display Screening and Consensus Analysis
810,PMC4622061,Surface Plasmon Resonance (SPR),Biacore T200,CM5 Sensor Chip,BiaEvaluation software,,1∶1,EGFR,epidermal growth factor receptor,EGFR-mFc,Receptor,P,,H. sapiens,ABX-EGF Tandem scFv,EGFR-targeting bispecific antibodies Tandem scFv,His-(ABX-EGF scFv)-G4S-(1H10 scFv)-myc,Antibody,P,,Mammalian,260000.0,400.0,0.000136,2.1e-07,5.2e-10,,,"tab2,fig2",Y,X,Y,R,10.4161/19420862.2014.985952,mAbs,2014-12-18,Nanocell targeting using engineered bispecific antibodies
233,PMC4140853,Bio-Layer Interferometry (BLI),ForteBio Octet RED96,SA chip,,Equilibrium analysis,,HLA-DQ2,cell surface receptor protein,,Receptor,P,,H. sapiens,gp42  I159C,glycoprotein 42   I159C,mutant,Protein,P,,Epstein-Barr virus,,,,,2.9e-08,8e-09,,tab2,Y,X,X,X,10.1371/journal.ppat.1004309,PLoS Pathogens,2014-08-21,Assembly and Architecture of the EBV B Cell Entry Triggering Complex
808,PMC4622061,Surface Plasmon Resonance (SPR),Biacore T200,CM5 Sensor Chip,BiaEvaluation software,,1∶1,EGFR,epidermal growth factor receptor,EGFR-mFc,Receptor,P,,H. sapiens,ABX-EGF IgG2 mAb,,,Antibody,P,,Mammalian,1970000.0,,0.000113,,5e-11,,A CM5 chip was coated with an anti-mouse IgG antibody,tab2,N,X,N,X,10.4161/19420862.2014.985952,mAbs,2014-12-18,Nanocell targeting using engineered bispecific antibodies
874,PMC3164629,Enzyme-linked Immunosorbent Assay (ELISA),ELISA,,,,,Deg 20 JRFL gp140,Deg 20 JRFL gp140,,glycoprotein,P,,H. sapiens immunodeficiency virus,4E10,4E10,,antibody,P,,,,,,,5.1e-09,,,Fig. 3,Y,X,N,X,10.1371/journal.ppat.1002200,PLoS Pathogens,2011-09-01,Envelope Deglycosylation Enhances Antigenicity of HIV-1 gp41 Epitopes for Both Broad Neutralizing Antibodies and Their Unmutated Ancestor Antibodies